BDBM335617 N-(3-(2-isopropyl-2H-tetrazol-5-yl)phenyl)-5-(((1R,5S)-3-methyl-3,8-diazabicyclo[3.2.1]octan-8-yl)methyl)pyrrolo[2,1-f][1,2,4]triazin-4-amine::US9737542, Example 60
SMILES CC(C)n1nnc(n1)-c1cccc(Nc2ncnn3ccc(CN4C5CCC4CN(C)C5)c23)c1
InChI Key InChIKey=LHQWMFMAZLOGPD-UHFFFAOYSA-N
Data  1 IC50
  Tab Delimited (TSV)   2D SDfile   Computed 3D by Vconf -m prep SDfile
Find this compound or compounds like it in BindingDB:
Activity Spreadsheet -- Enzyme Inhibition Constant Data from BindingDB
Found 1 hit for monomerid = 335617
TargetAP2-associated protein kinase 1(Homo sapiens (Human))
Bristol-Myers Squibb
US Patent
LigandPNGBDBM335617(N-(3-(2-isopropyl-2H-tetrazol-5-yl)phenyl)-5-(((1R...)
Affinity DataIC50:  550nM. Assay description: The assays were performed in U-bottom 384-well plates. The final assay volume was 30 μl prepared from 15 μl additions of enzyme and substra...
Ligand InfoPC cidPC sid
In DepthDetails US Patent