BDBM335654 US9737542, Example 94::ethyl 4-((3-(5-isopropyl-1,3,4-thiadiazol-2-yl)phenyl)amino)pyrrolo[2,1-f][1,2,4]triazine-5-carboxylate
SMILES CCOC(=O)c1ccn2ncnc(Nc3cccc(c3)-c3nnc(s3)C(C)C)c12
InChI Key InChIKey=GWOFRYASUGKAAU-UHFFFAOYSA-N
Data  1 IC50
  Tab Delimited (TSV)   2D SDfile   Computed 3D by Vconf -m prep SDfile
Find this compound or compounds like it in BindingDB:
Activity Spreadsheet -- Enzyme Inhibition Constant Data from BindingDB
Found 1 hit for monomerid = 335654
TargetAP2-associated protein kinase 1(Homo sapiens (Human))
Bristol-Myers Squibb
US Patent
LigandPNGBDBM335654(US9737542, Example 94 | ethyl 4-((3-(5-isopropyl-1...)
Affinity DataIC50:  474nM. Assay description: The assays were performed in U-bottom 384-well plates. The final assay volume was 30 μl prepared from 15 μl additions of enzyme and substra...
Ligand InfoPC cidPC sid
In DepthDetails US Patent