BDBM335660 N-(3-(2-isopropyl-2H-tetrazol-5-yl)phenyl)-5-(methoxymethyl)pyrrolo[2,1-f][1,2,4]triazin-4-amine::US9737542, Example 100
SMILES COCc1ccn2ncnc(Nc3cccc(c3)-c3nnn(n3)C(C)C)c12
InChI Key InChIKey=XETCJVPYWQKEHU-UHFFFAOYSA-N
Data  1 IC50
  Tab Delimited (TSV)   2D SDfile   Computed 3D by Vconf -m prep SDfile
Find this compound or compounds like it in BindingDB:
Activity Spreadsheet -- Enzyme Inhibition Constant Data from BindingDB
Found 1 hit for monomerid = 335660
TargetAP2-associated protein kinase 1(Homo sapiens (Human))
Bristol-Myers Squibb
US Patent
LigandPNGBDBM335660(N-(3-(2-isopropyl-2H-tetrazol-5-yl)phenyl)-5-(meth...)
Affinity DataIC50:  54nM. Assay description: The assays were performed in U-bottom 384-well plates. The final assay volume was 30 μl prepared from 15 μl additions of enzyme and substra...
Ligand InfoPC cidPC sid
In DepthDetails US Patent