BDBM335665 N-(cyclopropylmethyl)-4-((3-(2-isopropyl-2H-tetrazol-5-yl)phenyl)amino)pyrrolo[2,1-f][1,2,4]triazine-5-carboxamide::US9737542, Example 105
SMILES CC(C)n1nnc(n1)-c1cccc(Nc2ncnn3ccc(C(=O)NCC4CC4)c23)c1
InChI Key InChIKey=HKCWUSXUHKIIJZ-UHFFFAOYSA-N
Data  1 IC50
  Tab Delimited (TSV)   2D SDfile   Computed 3D by Vconf -m prep SDfile
Find this compound or compounds like it in BindingDB:
Activity Spreadsheet -- Enzyme Inhibition Constant Data from BindingDB
Found 1 hit for monomerid = 335665
TargetAP2-associated protein kinase 1(Homo sapiens (Human))
Bristol-Myers Squibb
US Patent
LigandPNGBDBM335665(N-(cyclopropylmethyl)-4-((3-(2-isopropyl-2H-tetraz...)
Affinity DataIC50:  785nM. Assay description: The assays were performed in U-bottom 384-well plates. The final assay volume was 30 μl prepared from 15 μl additions of enzyme and substra...
Ligand InfoPC cidPC sid
In DepthDetails US Patent