BDBM335678 US9737544, Compound 7
SMILES CNC(=O)\C=C(\c1cc(OC)cc(OC)c1)c1ccc2ncc(nc2n1)-c1cnn(C)c1
InChI Key InChIKey=UBLLKTCSEZOWKU-ZDLGFXPLSA-N
Data  5 IC50
  Tab Delimited (TSV)   2D SDfile   Computed 3D by Vconf -m prep SDfile
Find this compound or compounds like it in BindingDB:
Activity Spreadsheet -- Enzyme Inhibition Constant Data from BindingDB
Found 5 hits for monomerid = 335678
TargetFibroblast growth factor receptor 1(Homo sapiens (Human))
Astex Therapeutics
US Patent
LigandPNGBDBM335678(US9737544, Compound 7)
Affinity DataIC50:  501nM. Assay description: In a final reaction volume of 30 μL, FGFR1 (h) (25 ng/ml) was incubated with 50 mM HEPES pH 7.5, 6 mM MnCl2, 1 mM DTT, 0.1 mM Na3VO4, 0.01% Trit...
Ligand InfoPC cidPC sid
In DepthDetails US Patent
TargetFibroblast growth factor receptor 2(Homo sapiens (Human))
Astex Therapeutics
US Patent
LigandPNGBDBM335678(US9737544, Compound 7)
Affinity DataIC50:  251nM. Assay description: In a final reaction volume of 30 μL, FGFR2 (h) (150 ng/ml) was incubated with 50 mM HEPES pH 7.5, 6 mM MnCl2, 1 mM DTT, 0.1 mM Na3VO4, 0.01% Tri...
Ligand InfoPC cidPC sid
In DepthDetails US Patent
TargetVascular endothelial growth factor receptor 2(Homo sapiens (Human))
Astex Therapeutics
US Patent
LigandPNGBDBM335678(US9737544, Compound 7)
Affinity DataIC50: <1.00E+3nM. Assay description: In a final reaction volume of 30 μL, KDR (h) (150 ng/ml) was incubated with 50 mM HEPES pH 7.5, 6 mM MnCl2, 1 mM DTT, 0.1 mM Na3VO4, 0.01% Trito...
Ligand InfoPC cidPC sid
In DepthDetails US Patent
TargetFibroblast growth factor receptor 4(Homo sapiens (Human))
Astex Therapeutics
US Patent
LigandPNGBDBM335678(US9737544, Compound 7)
Affinity DataIC50: <1.00E+3nM. Assay description: In a final reaction volume of 30 μL, FGFR4 (h) (60 ng/ml) was incubated with 50 mM HEPES pH 7.5, 6 mM MnCl2, 1 mM DTT, 0.1 mM Na3VO4, 0.01% Trit...
Ligand InfoPC cidPC sid
In DepthDetails US Patent
TargetFibroblast growth factor receptor 3(Homo sapiens (Human))
Astex Therapeutics
US Patent
LigandPNGBDBM335678(US9737544, Compound 7)
Affinity DataIC50:  316nM. Assay description: In a final reaction volume of 30 μL, FGFR3 (h) (40 ng/ml) was incubated with 50 mM HEPES pH 7.5, 6 mM MnCl2, 1 mM DTT, 0.1 mM Na3VO4, 0.01% Trit...
Ligand InfoPC cidPC sid
In DepthDetails US Patent