BDBM335965 4-(2-(1-(3-Chloro-2-fluorophenyl)-1H-1,2,3-triazole-4-carbonyl)-5-(3-cyclopentylureido)-1,2,3,4-tetrahydroisoquinoline-1-carboxamido)benzoic acid::US9738655, Example 193
SMILES OC(=O)c1ccc(NC(=O)C2N(CCc3c(NC(=O)NC4CCCC4)cccc23)C(=O)c2cn(nn2)-c2cccc(Cl)c2F)cc1
InChI Key InChIKey=LJVRVBNTOCCTEO-UHFFFAOYSA-N
Data  2 KI
  Tab Delimited (TSV)   2D SDfile   Computed 3D by Vconf -m prep SDfile
Find this compound or compounds like it in BindingDB:
Activity Spreadsheet -- Enzyme Inhibition Constant Data from BindingDB
Found 2 hits for monomerid = 335965
TargetPlasma kallikrein(Homo sapiens (Human))
Bristol-Myers Squibb
US Patent
LigandPNGBDBM335965(4-(2-(1-(3-Chloro-2-fluorophenyl)-1H-1,2,3-triazol...)
Affinity DataKi:  2.34nM. Assay description: Plasma kallikrein determinations were made in 0.1 M sodium phosphate buffer at a pH of 7.5 containing 0.1-0.2 M sodium chloride and 0.5% PEG 8000. De...
Ligand InfoPC cidPC sid
In DepthDetails US Patent
TargetCoagulation factor XI(Homo sapiens (Human))
Bristol-Myers Squibb
US Patent
LigandPNGBDBM335965(4-(2-(1-(3-Chloro-2-fluorophenyl)-1H-1,2,3-triazol...)
Affinity DataKi:  19.9nM. Assay description: Factor XIa determinations were made in 50 mM HEPES buffer at pH 7.4 containing 145 mM NaCl, 5 mM KCl, and 0.1% PEG 8000 (polyethylene glycol; JT Bake...
Ligand InfoPC cidPC sid
In DepthDetails US Patent