BDBM33603 1-[3-(2-furanyl)-5-(phenylmethylthio)-1,2,4-triazol-1-yl]-1-butanone::1-[3-(furan-2-yl)-5-(phenylmethylsulfanyl)-1,2,4-triazol-1-yl]butan-1-one::1-[5-(benzylthio)-3-(2-furyl)-1,2,4-triazol-1-yl]butan-1-one::1-[5-benzylsulfanyl-3-(furan-2-yl)-1,2,4-triazol-1-yl]butan-1-one::MLS000115331::SMR000092474::cid_3586644
SMILES CCCC(=O)n1nc(nc1SCc1ccccc1)-c1ccco1
InChI Key InChIKey=IYDMCAIHPVAOCX-UHFFFAOYSA-N
Data  2 IC50
  Tab Delimited (TSV)   2D SDfile   Computed 3D by Vconf -m prep SDfile
Find this compound or compounds like it in BindingDB:
Activity Spreadsheet -- Enzyme Inhibition Constant Data from BindingDB
Found 2 hits for monomerid = 33603
TargetComplement C1s subcomponent(Homo sapiens (Human))
Pcmd
Curated by PubChem BioAssay
LigandPNGBDBM33603(1-[3-(2-furanyl)-5-(phenylmethylthio)-1,2,4-triazo...)
Affinity DataIC50: >5.00E+4nM. Assay description: Molecular Library Screening Center Network (MLSCN) Penn Center for Molecular Discovery (PCMD) Assay Provider: Dr. Scott L. Diamond, University of Pen...
In DepthDetails PCBioAssay
TargetProthrombin(Homo sapiens (Human))
Pcmd
Curated by PubChem BioAssay
LigandPNGBDBM33603(1-[3-(2-furanyl)-5-(phenylmethylthio)-1,2,4-triazo...)
Affinity DataIC50:  23.2nMpH: 7.5 T: 2°C. Assay description: HTS was performed using 217,350 compounds of the MLSCN library individually plated into 10ul 1536 compound plates at a concentration of 2.5 mM each, ...
In DepthDetails PCBioAssay