BDBM336201 US9744148, 70
SMILES CC(C)C(OC(=O)Cc1ccc(Cl)cc1)C(=O)Nc1cc(C)on1
InChI Key InChIKey=JINVFZJRGDWGTQ-UHFFFAOYSA-N
Data  1 IC50
  Tab Delimited (TSV)   2D SDfile   Computed 3D by Vconf -m prep SDfile
Find this compound or compounds like it in BindingDB:
Activity Spreadsheet -- Enzyme Inhibition Constant Data from BindingDB
Found 1 hit for monomerid = 336201
TargetKallikrein-7(Homo sapiens (Human))
Sixera Pharma
US Patent
LigandPNGBDBM336201(US9744148, 70)
Affinity DataIC50:  2.70E+3nM. Assay description: Substrate:(MeO-Suc-Arg-Pro-Tyr-pNA), acetate salt, Peptide international, lot #906841, previously named S-2586Enzyme: Active human KLK7 (SCCE) 0.62 m...
In DepthDetails US Patent