BDBM336208 US9744148, 77
SMILES COc1ccc(CC(=O)OCC(=O)Nc2ccccc2)cc1
InChI Key InChIKey=UWFNJCSIBQSEMH-UHFFFAOYSA-N
Data  1 IC50
  Tab Delimited (TSV)   2D SDfile   Computed 3D by Vconf -m prep SDfile
Find this compound or compounds like it in BindingDB:
Activity Spreadsheet -- Enzyme Inhibition Constant Data from BindingDB
Found 1 hit for monomerid = 336208
TargetKallikrein-7(Homo sapiens (Human))
Sixera Pharma
US Patent
LigandPNGBDBM336208(US9744148, 77)
Affinity DataIC50:  3.89E+3nM. Assay description: Substrate:(MeO-Suc-Arg-Pro-Tyr-pNA), acetate salt, Peptide international, lot #906841, previously named S-2586Enzyme: Active human KLK7 (SCCE) 0.62 m...
In DepthDetails US Patent