BDBM33651 2-furanyl-[3-(2-furanyl)-5-(phenylmethylthio)-1,2,4-triazol-1-yl]methanone::5-(benzylthio)-1-(2-furoyl)-3-(2-furyl)-1H-1,2,4-triazole::MLS000536898::SMR000143507::[5-(benzylthio)-3-(2-furyl)-1,2,4-triazol-1-yl]-(2-furyl)methanone::[5-benzylsulfanyl-3-(furan-2-yl)-1,2,4-triazol-1-yl]-(furan-2-yl)methanone::cid_1289319::furan-2-yl-[3-(furan-2-yl)-5-(phenylmethylsulfanyl)-1,2,4-triazol-1-yl]methanone
SMILES O=C(c1ccco1)n1nc(nc1SCc1ccccc1)-c1ccco1
InChI Key InChIKey=PTDOIMLOIFBWKR-UHFFFAOYSA-N
Data  1 IC50
  Tab Delimited (TSV)   2D SDfile   Computed 3D by Vconf -m prep SDfile
Find this compound or compounds like it in BindingDB:
Activity Spreadsheet -- Enzyme Inhibition Constant Data from BindingDB
Found 1 hit for monomerid = 33651
TargetProthrombin(Homo sapiens (Human))
Pcmd
Curated by PubChem BioAssay
LigandPNGBDBM33651(2-furanyl-[3-(2-furanyl)-5-(phenylmethylthio)-1,2,...)
Affinity DataIC50:  201nMpH: 7.5 T: 2°C. Assay description: HTS was performed using 217,350 compounds of the MLSCN library individually plated into 10ul 1536 compound plates at a concentration of 2.5 mM each, ...
In DepthDetails PCBioAssay