BDBM336547 4-(6-(2-carboxyethylamino)-1-(2-chloro-6-(trifluoromethyl)benzoyl)-1H-indazol-3-yl)-3-fluorobenzoic acid::US9745265, 6C
SMILES OC(=O)CCNc1ccc2c(nn(C(=O)c3c(Cl)cccc3C(F)(F)F)c2c1)-c1ccc(cc1F)C(O)=O
InChI Key InChIKey=FWXDCINMHCWFAU-UHFFFAOYSA-N
Data  1 IC50
  Tab Delimited (TSV)   2D SDfile   Computed 3D by Vconf -m prep SDfile
Find this compound or compounds like it in BindingDB:
Activity Spreadsheet -- Enzyme Inhibition Constant Data from BindingDB
Found 1 hit for monomerid = 336547
TargetNuclear receptor ROR-gamma(Mus musculus)
Merck Sharp & Dohme
US Patent
LigandPNGBDBM336547(4-(6-(2-carboxyethylamino)-1-(2-chloro-6-(trifluor...)
Affinity DataIC50:  22nM. Assay description: To identify novel antagonists of RORgammaT, an assay was developed which employs the interaction of RORgammaT with its co-activator peptide SRC1_2. T...
Ligand InfoPC cidPC sid
In DepthDetails US Patent