BDBM336549 US9745283, Example 17
SMILES COc1cc2nccc(Oc3ccc(NC(=O)c4c[nH]c(=O)n(-c5ccc(F)cc5)c4=O)cc3F)c2cc1OC
InChI Key InChIKey=OMGRFVAGZMFWJX-UHFFFAOYSA-N
Data  2 IC50
  Tab Delimited (TSV)   2D SDfile   Computed 3D by Vconf -m prep SDfile
Find this compound or compounds like it in BindingDB:
Activity Spreadsheet -- Enzyme Inhibition Constant Data from BindingDB
Found 2 hits for monomerid = 336549
TargetHepatocyte growth factor receptor(Homo sapiens (Human))
Ignyta
US Patent
LigandPNGBDBM336549(US9745283, Example 17)
Affinity DataIC50: <10nM. Assay description: The cMET kinase assay was performed in 384-well Fluotrac 200 HiBase microplates using the HTRF KinEASE assay described above for AXL except that the ...
Ligand InfoPC cidPC sid
In DepthDetails US Patent
TargetTyrosine-protein kinase receptor UFO(Homo sapiens (Human))
Ignyta
US Patent
LigandPNGBDBM336549(US9745283, Example 17)
Affinity DataIC50: <10nM. Assay description: The ability of compounds to inhibit the kinase activity of recombinant human baculovirus-expressed AXL was measured by homogeneous TRF (HTRF) using C...
Ligand InfoPC cidPC sid
In DepthDetails US Patent