BDBM336716 US9745283, Example 145
SMILES COc1cc(Oc2ccnc3cc(OC)c(OC)cc23)ccc1NC(=O)c1cn(C(C)C)c(=O)n(-c2ccc(F)cc2)c1=O
InChI Key InChIKey=PQGGQASXUUTLTN-UHFFFAOYSA-N
Data  2 IC50
  Tab Delimited (TSV)   2D SDfile   Computed 3D by Vconf -m prep SDfile
Find this compound or compounds like it in BindingDB:
Activity Spreadsheet -- Enzyme Inhibition Constant Data from BindingDB
Found 2 hits for monomerid = 336716
TargetHepatocyte growth factor receptor(Homo sapiens (Human))
Ignyta
US Patent
LigandPNGBDBM336716(US9745283, Example 145)
Affinity DataIC50:  55nM. Assay description: The cMET kinase assay was performed in 384-well Fluotrac 200 HiBase microplates using the HTRF KinEASE assay described above for AXL except that the ...
Ligand InfoPC cidPC sid
In DepthDetails US Patent
TargetTyrosine-protein kinase receptor UFO(Homo sapiens (Human))
Ignyta
US Patent
LigandPNGBDBM336716(US9745283, Example 145)
Affinity DataIC50: <10nM. Assay description: The ability of compounds to inhibit the kinase activity of recombinant human baculovirus-expressed AXL was measured by homogeneous TRF (HTRF) using C...
Ligand InfoPC cidPC sid
In DepthDetails US Patent