BDBM336834 US9745289, Compound 6AA::US9745289, Compound 6AB::US9745289, Compound 6BA::US9745289, Compound 6BB
SMILES CN1C(CCC1=O)c1cncc(c1)C1COc2c(O1)cccc2C(N)=O
InChI Key InChIKey=GHGGZPDXSJLFKQ-UHFFFAOYSA-N
Data  8 IC50
  Tab Delimited (TSV)   2D SDfile   Computed 3D by Vconf -m prep SDfile
Find this compound or compounds like it in BindingDB:
Activity Spreadsheet -- Enzyme Inhibition Constant Data from BindingDB
Found 8 hits for monomerid = 336834
TargetCytochrome P450 11B2, mitochondrial(Homo sapiens (Human))
Boehringer Ingelheim International
US Patent
LigandPNGBDBM336834(US9745289, Compound 6AA | US9745289, Compound 6AB ...)
Affinity DataIC50:  26nM. Assay description: Assays are performed in 96-well format in a final volume of 60 μL/well, containing 100 mM potassium phosphate, pH 7.4, 1% (v/v) DMSO, and additi...
Ligand InfoPC cidPC sid
In DepthDetails US Patent
TargetCytochrome P450 11B1, mitochondrial(Homo sapiens (Human))
Boehringer Ingelheim International
US Patent
LigandPNGBDBM336834(US9745289, Compound 6AA | US9745289, Compound 6AB ...)
Affinity DataIC50:  2.20E+3nM. Assay description: Assays are performed in 96-well format in a final volume of 60 μL/well, containing 100 mM potassium phosphate, pH 7.4, 1% (v/v) DMSO, and additi...
Ligand InfoPC cidPC sid
In DepthDetails US Patent
TargetCytochrome P450 11B2, mitochondrial(Homo sapiens (Human))
Boehringer Ingelheim International
US Patent
LigandPNGBDBM336834(US9745289, Compound 6AA | US9745289, Compound 6AB ...)
Affinity DataIC50:  70nM. Assay description: Assays are performed in 96-well format in a final volume of 60 μL/well, containing 100 mM potassium phosphate, pH 7.4, 1% (v/v) DMSO, and additi...
Ligand InfoPC cidPC sid
In DepthDetails US Patent
TargetCytochrome P450 11B1, mitochondrial(Homo sapiens (Human))
Boehringer Ingelheim International
US Patent
LigandPNGBDBM336834(US9745289, Compound 6AA | US9745289, Compound 6AB ...)
Affinity DataIC50: >3.00E+4nM. Assay description: Assays are performed in 96-well format in a final volume of 60 μL/well, containing 100 mM potassium phosphate, pH 7.4, 1% (v/v) DMSO, and additi...
Ligand InfoPC cidPC sid
In DepthDetails US Patent
TargetCytochrome P450 11B2, mitochondrial(Homo sapiens (Human))
Boehringer Ingelheim International
US Patent
LigandPNGBDBM336834(US9745289, Compound 6AA | US9745289, Compound 6AB ...)
Affinity DataIC50:  190nM. Assay description: Assays are performed in 96-well format in a final volume of 60 μL/well, containing 100 mM potassium phosphate, pH 7.4, 1% (v/v) DMSO, and additi...
Ligand InfoPC cidPC sid
In DepthDetails US Patent
TargetCytochrome P450 11B1, mitochondrial(Homo sapiens (Human))
Boehringer Ingelheim International
US Patent
LigandPNGBDBM336834(US9745289, Compound 6AA | US9745289, Compound 6AB ...)
Affinity DataIC50: >3.00E+4nM. Assay description: Assays are performed in 96-well format in a final volume of 60 μL/well, containing 100 mM potassium phosphate, pH 7.4, 1% (v/v) DMSO, and additi...
Ligand InfoPC cidPC sid
In DepthDetails US Patent
TargetCytochrome P450 11B2, mitochondrial(Homo sapiens (Human))
Boehringer Ingelheim International
US Patent
LigandPNGBDBM336834(US9745289, Compound 6AA | US9745289, Compound 6AB ...)
Affinity DataIC50:  1.00E+3nM. Assay description: Assays are performed in 96-well format in a final volume of 60 μL/well, containing 100 mM potassium phosphate, pH 7.4, 1% (v/v) DMSO, and additi...
Ligand InfoPC cidPC sid
In DepthDetails US Patent
TargetCytochrome P450 11B1, mitochondrial(Homo sapiens (Human))
Boehringer Ingelheim International
US Patent
LigandPNGBDBM336834(US9745289, Compound 6AA | US9745289, Compound 6AB ...)
Affinity DataIC50:  1.00E+4nM. Assay description: Assays are performed in 96-well format in a final volume of 60 μL/well, containing 100 mM potassium phosphate, pH 7.4, 1% (v/v) DMSO, and additi...
Ligand InfoPC cidPC sid
In DepthDetails US Patent