BDBM336872 US9745289, Compound 24A::US9745289, Compound 24B
SMILES CN(Cc1cncc(c1)C1COc2c(O1)cccc2C(N)=O)C(=O)C1CC1
InChI Key InChIKey=RGZQNFXPXLFZQQ-UHFFFAOYSA-N
Data  4 IC50
  Tab Delimited (TSV)   2D SDfile   Computed 3D by Vconf -m prep SDfile
Find this compound or compounds like it in BindingDB:
Activity Spreadsheet -- Enzyme Inhibition Constant Data from BindingDB
Found 4 hits for monomerid = 336872
TargetCytochrome P450 11B2, mitochondrial(Homo sapiens (Human))
Boehringer Ingelheim International
US Patent
LigandPNGBDBM336872(US9745289, Compound 24A | US9745289, Compound 24B)
Affinity DataIC50:  18nM. Assay description: Assays are performed in 96-well format in a final volume of 60 μL/well, containing 100 mM potassium phosphate, pH 7.4, 1% (v/v) DMSO, and additi...
Ligand InfoPC cidPC sid
In DepthDetails US Patent
TargetCytochrome P450 11B1, mitochondrial(Homo sapiens (Human))
Boehringer Ingelheim International
US Patent
LigandPNGBDBM336872(US9745289, Compound 24A | US9745289, Compound 24B)
Affinity DataIC50:  2.50E+4nM. Assay description: Assays are performed in 96-well format in a final volume of 60 μL/well, containing 100 mM potassium phosphate, pH 7.4, 1% (v/v) DMSO, and additi...
Ligand InfoPC cidPC sid
In DepthDetails US Patent
TargetCytochrome P450 11B2, mitochondrial(Homo sapiens (Human))
Boehringer Ingelheim International
US Patent
LigandPNGBDBM336872(US9745289, Compound 24A | US9745289, Compound 24B)
Affinity DataIC50:  61nM. Assay description: Assays are performed in 96-well format in a final volume of 60 μL/well, containing 100 mM potassium phosphate, pH 7.4, 1% (v/v) DMSO, and additi...
Ligand InfoPC cidPC sid
In DepthDetails US Patent
TargetCytochrome P450 11B1, mitochondrial(Homo sapiens (Human))
Boehringer Ingelheim International
US Patent
LigandPNGBDBM336872(US9745289, Compound 24A | US9745289, Compound 24B)
Affinity DataIC50:  7.00E+3nM. Assay description: Assays are performed in 96-well format in a final volume of 60 μL/well, containing 100 mM potassium phosphate, pH 7.4, 1% (v/v) DMSO, and additi...
Ligand InfoPC cidPC sid
In DepthDetails US Patent