BDBM336937 US9745289, Compound 56A::US9745289, Compound 56B
SMILES C[C@H](O)c1c(F)cncc1C1COc2c(O1)cccc2C(N)=O
InChI Key InChIKey=UNQIOQROCZZZHI-OADYLZGLSA-N
Data  4 IC50
  Tab Delimited (TSV)   2D SDfile   Computed 3D by Vconf -m prep SDfile
Find this compound or compounds like it in BindingDB:
Activity Spreadsheet -- Enzyme Inhibition Constant Data from BindingDB
Found 4 hits for monomerid = 336937
TargetCytochrome P450 11B2, mitochondrial(Homo sapiens (Human))
Boehringer Ingelheim International
US Patent
LigandPNGBDBM336937(US9745289, Compound 56A | US9745289, Compound 56B)
Affinity DataIC50:  78nM. Assay description: Assays are performed in 96-well format in a final volume of 60 μL/well, containing 100 mM potassium phosphate, pH 7.4, 1% (v/v) DMSO, and additi...
Ligand InfoPC cidPC sid
In DepthDetails US Patent
TargetCytochrome P450 11B1, mitochondrial(Homo sapiens (Human))
Boehringer Ingelheim International
US Patent
LigandPNGBDBM336937(US9745289, Compound 56A | US9745289, Compound 56B)
Affinity DataIC50:  1.40E+4nM. Assay description: Assays are performed in 96-well format in a final volume of 60 μL/well, containing 100 mM potassium phosphate, pH 7.4, 1% (v/v) DMSO, and additi...
Ligand InfoPC cidPC sid
In DepthDetails US Patent
TargetCytochrome P450 11B2, mitochondrial(Homo sapiens (Human))
Boehringer Ingelheim International
US Patent
LigandPNGBDBM336937(US9745289, Compound 56A | US9745289, Compound 56B)
Affinity DataIC50:  24nM. Assay description: Assays are performed in 96-well format in a final volume of 60 μL/well, containing 100 mM potassium phosphate, pH 7.4, 1% (v/v) DMSO, and additi...
Ligand InfoPC cidPC sid
In DepthDetails US Patent
TargetCytochrome P450 11B1, mitochondrial(Homo sapiens (Human))
Boehringer Ingelheim International
US Patent
LigandPNGBDBM336937(US9745289, Compound 56A | US9745289, Compound 56B)
Affinity DataIC50:  1.40E+4nM. Assay description: Assays are performed in 96-well format in a final volume of 60 μL/well, containing 100 mM potassium phosphate, pH 7.4, 1% (v/v) DMSO, and additi...
Ligand InfoPC cidPC sid
In DepthDetails US Patent