BDBM337119 US9745291, Compound 165::US9765068, Compound 165
SMILES OC(CNC(=O)C(O)c1ccccc1)CN1CCc2ccccc2C1
InChI Key InChIKey=CSHCDJYSGJYKAD-UHFFFAOYSA-N
Data  2 IC50
  Tab Delimited (TSV)   2D SDfile   Computed 3D by Vconf -m prep SDfile
Find this compound or compounds like it in BindingDB:
Activity Spreadsheet -- Enzyme Inhibition Constant Data from BindingDB
Found 2 hits for monomerid = 337119
TargetProtein arginine N-methyltransferase 5(Homo sapiens (Human))
Epizyme
US Patent
LigandPNGBDBM337119(US9745291, Compound 165 | US9765068, Compound 165)
Affinity DataIC50:  550nM. Assay description: Molecular Biology: Full-length human PRMT5 (NM_006109.3) transcript variant 1 clone was amplified from a fetal brain cDNA library, incorporating flan...
In DepthDetails US Patent
TargetMethylosome protein 50/Protein arginine N-methyltransferase 5(Homo sapiens (Human))
Epizyme
US Patent
LigandPNGBDBM337119(US9745291, Compound 165 | US9765068, Compound 165)
Affinity DataIC50:  550nM. Assay description: The assays were all performed in a buffer consisting of 20 mM Bicine (pH=7.6), 1 mM TCEP, 0.005% BSG, and 0.002% Tween20, prepared on the day of use....
In DepthDetails US Patent