BDBM337134 US9745291, Compound 180::US9765068, Compound 180
SMILES O[C@@H](CNC(=O)C1CCCc2ccccc12)CN1CCc2ccccc2C1
InChI Key InChIKey=VTMTUYAENUEDDB-AIBWNMTMSA-N
Data  2 IC50
  Tab Delimited (TSV)   2D SDfile   Computed 3D by Vconf -m prep SDfile
Find this compound or compounds like it in BindingDB:
Activity Spreadsheet -- Enzyme Inhibition Constant Data from BindingDB
Found 2 hits for monomerid = 337134
TargetProtein arginine N-methyltransferase 5(Homo sapiens (Human))
Epizyme
US Patent
LigandPNGBDBM337134(US9745291, Compound 180 | US9765068, Compound 180)
Affinity DataIC50:  5.50E+3nM. Assay description: Molecular Biology: Full-length human PRMT5 (NM_006109.3) transcript variant 1 clone was amplified from a fetal brain cDNA library, incorporating flan...
Ligand InfoPC cidPC sid
In DepthDetails US Patent
TargetMethylosome protein 50/Protein arginine N-methyltransferase 5(Homo sapiens (Human))
Epizyme
US Patent
LigandPNGBDBM337134(US9745291, Compound 180 | US9765068, Compound 180)
Affinity DataIC50:  5.50E+3nM. Assay description: The assays were all performed in a buffer consisting of 20 mM Bicine (pH=7.6), 1 mM TCEP, 0.005% BSG, and 0.002% Tween20, prepared on the day of use....
Ligand InfoPC cidPC sid
In DepthDetails US Patent