BDBM337374 6-[4-(2,3-Dihydro-1H-pyrrolo[3,2-c]pyridin-4-yloxy)phenyl]-1,5-dimethylpyrimidine-2,4(1H,3H)-dione (12)::US9745317, 12
SMILES Cc1c(-c2ccc(Oc3nccc4NCCc34)cc2)n(C)c(=O)[nH]c1=O
InChI Key InChIKey=VHTXUSXOCGZBMT-UHFFFAOYSA-N
Data  1 KI
  Tab Delimited (TSV)   2D SDfile   Computed 3D by Vconf -m prep SDfile
Find this compound or compounds like it in BindingDB:
Activity Spreadsheet -- Enzyme Inhibition Constant Data from BindingDB
Found 1 hit for monomerid = 337374
TargetD(1A) dopamine receptor(Homo sapiens (Human))
Pfizer
US Patent
LigandPNGBDBM337374(6-[4-(2,3-Dihydro-1H-pyrrolo[3,2-c]pyridin-4-yloxy...)
Affinity DataKi:  11.1nM. Assay description: D1 binding assays were performed using over-expressing LTK human cell lines. To determine basic assay parameters, ligand concentrations were determin...
Ligand InfoPC cidPC sid
In DepthDetails US Patent