BDBM337376 5-[4-(3,4-Dihydro-2H-pyrano[3,2-c]pyridin-5-yloxy)-2-methylphenyl]-4,6-dimethylpyridazin-3(2H)-one (14)::US9745317, 14
SMILES CC1(C)c2cccc(P(c3ccccc3)c3ccccc3)c2Cc2c(cccc12)P(c1ccccc1)c1ccccc1
InChI Key InChIKey=XPJKWTOMGVDRDJ-UHFFFAOYSA-N
Data  1 KI
  Tab Delimited (TSV)   2D SDfile   Computed 3D by Vconf -m prep SDfile
Find this compound or compounds like it in BindingDB:
Activity Spreadsheet -- Enzyme Inhibition Constant Data from BindingDB
Found 1 hit for monomerid = 337376
TargetD(1A) dopamine receptor(Homo sapiens (Human))
Pfizer
US Patent
LigandPNGBDBM337376(5-[4-(3,4-Dihydro-2H-pyrano[3,2-c]pyridin-5-yloxy)...)
Affinity DataKi:  70.3nM. Assay description: D1 binding assays were performed using over-expressing LTK human cell lines. To determine basic assay parameters, ligand concentrations were determin...
Ligand InfoPC cidPC sid
In DepthDetails US Patent