BDBM337460 US9745321, Compound 82
SMILES COc1ncc(cc1NS(=O)(=O)C1CC1)-c1nc(nc2c(CN3CCN(CC3)C(=O)C(F)(F)F)c(C)sc12)N1CCOCC1
InChI Key InChIKey=CTZWNFBBCSXMAV-UHFFFAOYSA-N
Data  1 IC50
  Tab Delimited (TSV)   2D SDfile   Computed 3D by Vconf -m prep SDfile
Find this compound or compounds like it in BindingDB:
Activity Spreadsheet -- Enzyme Inhibition Constant Data from BindingDB
Found 1 hit for monomerid = 337460
TargetPhosphatidylinositol 4,5-bisphosphate 3-kinase catalytic subunit delta isoform(Homo sapiens (Human))
Shanghai Yingli Pharmaceutical
US Patent
LigandPNGBDBM337460(US9745321, Compound 82)
Affinity DataIC50:  15nM. Assay description: 1. Buffer preparation: 50 mM HEPES, pH 7.5, 3 mM MgCl2, 1 mM EGTA, 100 mM NaCl, 0.03% CHAPS.2. Compound was formulated in 100% DMSO in a concentratio...
Ligand InfoPC cidPC sid
In DepthDetails US Patent