BDBM337497 US9745321, Compound 119
SMILES COC(=O)C(C)(C)N1CCN(Cc2c(C)sc3c(nc(nc23)N2CCOCC2)-c2cnc(OC)c(NS(C)(=O)=O)c2)CC1
InChI Key InChIKey=IXIOAVFKKOKLBE-UHFFFAOYSA-N
Data  1 IC50
  Tab Delimited (TSV)   2D SDfile   Computed 3D by Vconf -m prep SDfile
Find this compound or compounds like it in BindingDB:
Activity Spreadsheet -- Enzyme Inhibition Constant Data from BindingDB
Found 1 hit for monomerid = 337497
TargetPhosphatidylinositol 4,5-bisphosphate 3-kinase catalytic subunit delta isoform(Homo sapiens (Human))
Shanghai Yingli Pharmaceutical
US Patent
LigandPNGBDBM337497(US9745321, Compound 119)
Affinity DataIC50:  5nM. Assay description: 1. Buffer preparation: 50 mM HEPES, pH 7.5, 3 mM MgCl2, 1 mM EGTA, 100 mM NaCl, 0.03% CHAPS.2. Compound was formulated in 100% DMSO in a concentratio...
Ligand InfoPC cidPC sid
In DepthDetails US Patent