BDBM337555 US9745324, 24
SMILES COCCC(=O)Nc1ccc(F)c(c1)[C@]1(C)CN(C)S(=O)(=O)C(C)(C)C(=N)N1
InChI Key InChIKey=CZADHVWRUJKDKE-SFHVURJKSA-N
Data  2 KI
  Tab Delimited (TSV)   2D SDfile   Computed 3D by Vconf -m prep SDfile
Find this compound or compounds like it in BindingDB:
Activity Spreadsheet -- Enzyme Inhibition Constant Data from BindingDB
Found 2 hits for monomerid = 337555
TargetBeta-secretase 2(Homo sapiens (Human))
Merck Sharp & Dohme
US Patent
LigandPNGBDBM337555(US9745324, 24)
Affinity DataKi:  4.09E+3nM. Assay description: Inhibitor IC50s at purified human autoBACE-2 are determined in a time-resolved endpoint proteolysis assay that measures hydrolysis of the QSY7-EISEVN...
Ligand InfoPC cidPC sid
In DepthDetails US Patent
TargetBeta-secretase 1(Homo sapiens (Human))
Merck Sharp & Dohme
US Patent
LigandPNGBDBM337555(US9745324, 24)
Affinity DataKi: >9.76E+3nM. Assay description: Reagents: Na+-Acetate pH 5.0; 1% Brij-35; Glycerol; Dimethyl Sulfoxide (DMSO); Recombinant human soluble BACE1 catalytic domain (>95% pure); APP Swed...
Ligand InfoPC cidPC sid
In DepthDetails US Patent