BDBM337685 3-(2,3-Dichlorobenzyl)-2,4-dioxo-1-[4-(2-oxo-2,3-dihydro-1H-imidazol-1-yl)phenyl]-1,2,3,4-tetrahydropyrimidine-5-carboxylic acid::US9751843, 60
SMILES OC(=O)c1cn(-c2ccc(cc2)-n2cc[nH]c2=O)c(=O)n(Cc2cccc(Cl)c2Cl)c1=O
InChI Key InChIKey=FGNRXHJLONISDM-UHFFFAOYSA-N
Data  1 IC50
  Tab Delimited (TSV)   2D SDfile   Computed 3D by Vconf -m prep SDfile
Find this compound or compounds like it in BindingDB:
Activity Spreadsheet -- Enzyme Inhibition Constant Data from BindingDB
Found 1 hit for monomerid = 337685
TargetChymase(Homo sapiens (Human))
Bayer Pharma Aktiengesellschaft
US Patent
LigandPNGBDBM337685(3-(2,3-Dichlorobenzyl)-2,4-dioxo-1-[4-(2-oxo-2,3-d...)
Affinity DataIC50:  68nM. Assay description: The enzyme source used is recombinant human chymase (expressed in HEK293 cells) or chymase purified from hamsters' tongues. The substrate used fo...
Ligand InfoPC cidPC sid
In DepthDetails US Patent