BDBM337738 1-[4-(5-Methyl-1,3,4-oxadiazol-2-yl)phenyl]-3-[2-methyl-3-(trifluoromethyl)benzyl]-2,4-dioxo-1,2,3,4-tetrahydropyrimidine-5-carboxylic acid::US9751843, 109
SMILES Cc1nnc(o1)-c1ccc(cc1)-n1cc(C(O)=O)c(=O)n(Cc2cccc(c2C)C(F)(F)F)c1=O
InChI Key InChIKey=KOQSHRCOCSLLBA-UHFFFAOYSA-N
Data  1 IC50
  Tab Delimited (TSV)   2D SDfile   Computed 3D by Vconf -m prep SDfile
Find this compound or compounds like it in BindingDB:
Activity Spreadsheet -- Enzyme Inhibition Constant Data from BindingDB
Found 1 hit for monomerid = 337738
TargetChymase(Homo sapiens (Human))
Bayer Pharma Aktiengesellschaft
US Patent
LigandPNGBDBM337738(1-[4-(5-Methyl-1,3,4-oxadiazol-2-yl)phenyl]-3-[2-m...)
Affinity DataIC50:  680nM. Assay description: The enzyme source used is recombinant human chymase (expressed in HEK293 cells) or chymase purified from hamsters' tongues. The substrate used fo...
Ligand InfoPC cidPC sid
In DepthDetails US Patent