BDBM337758 1-[3-Chloro-4-(2-oxo-1,3-oxazolidin-3-yl)phenyl]-3-[2-chloro-3-(trifluoromethyl)benzyl]-2,4-dioxo-1,2,3,4-tetrahydropyrimidine-5-carboxylic acid::US9751843, 151
SMILES OC(=O)c1cn(-c2ccc(N3CCOC3=O)c(Cl)c2)c(=O)n(Cc2cccc(c2Cl)C(F)(F)F)c1=O
InChI Key InChIKey=VFNMFQTVIYXDMS-UHFFFAOYSA-N
Data  1 IC50
  Tab Delimited (TSV)   2D SDfile   Computed 3D by Vconf -m prep SDfile
Find this compound or compounds like it in BindingDB:
Activity Spreadsheet -- Enzyme Inhibition Constant Data from BindingDB
Found 1 hit for monomerid = 337758
TargetChymase(Homo sapiens (Human))
Bayer Pharma Aktiengesellschaft
US Patent
LigandPNGBDBM337758(1-[3-Chloro-4-(2-oxo-1,3-oxazolidin-3-yl)phenyl]-3...)
Affinity DataIC50:  17nM. Assay description: The enzyme source used is recombinant human chymase (expressed in HEK293 cells) or chymase purified from hamsters' tongues. The substrate used fo...
Ligand InfoPC cidPC sid
In DepthDetails US Patent