BDBM337982 US9751854, Compound I-158::US9802960, Compound I-158
SMILES CC(=O)Nc1cc(ccn1)-c1cnc2[nH]cc(c2c1)S(=O)(=O)N1CCCC1
InChI Key InChIKey=FOFZVQUQNSTMRD-UHFFFAOYSA-N
Data  2 IC50
  Tab Delimited (TSV)   2D SDfile   Computed 3D by Vconf -m prep SDfile
Find this compound or compounds like it in BindingDB:
Activity Spreadsheet -- Enzyme Inhibition Constant Data from BindingDB
Found 2 hits for monomerid = 337982
TargetPhosphatidylinositol 3-kinase catalytic subunit type 3(Homo sapiens (Human))
Millennium Pharmaceuticals
US Patent
LigandPNGBDBM337982(US9751854, Compound I-158 | US9802960, Compound I-...)
Affinity DataIC50: <10nM. Assay description: 100 nL compounds in DMSO are added to wells of a 384 well microtitre plate (Greiner 780076). At room temperature: 5 ul VPS34 reaction buffer (Invitro...
Ligand InfoPC cidPC sid
In DepthDetails US Patent
TargetPhosphatidylinositol 3-kinase catalytic subunit type 3(Homo sapiens (Human))
Millennium Pharmaceuticals
US Patent
LigandPNGBDBM337982(US9751854, Compound I-158 | US9802960, Compound I-...)
Affinity DataIC50: <10nM. Assay description: 100 nL compounds in DMSO are added to wells of a 384 well microtitre plate (Greiner 780076). At room temperature: 5 ul VPS34 reaction buffer (Invitro...
Ligand InfoPC cidPC sid
In DepthDetails US Patent