BDBM338383 (3R,6S)-2-(4-(4-(4H-1,2,4-triazol-4- yl)piperidin-1-yl)-2,5- difluorobenzyl)-6-phenyl-3- (trifluoromethyl)-1,2-thiazinane 1,1- dioxide::US9751873, Example 71
SMILES Fc1cc(N2CCC(CC2)n2cnnc2)c(F)cc1CN1[C@H](CC[C@@H](c2ccccc2)S1(=O)=O)C(F)(F)F
InChI Key InChIKey=MGLBELNSPGPLKZ-BJKOFHAPSA-N
Data  1 IC50
  Tab Delimited (TSV)   2D SDfile   Computed 3D by Vconf -m prep SDfile
Find this compound or compounds like it in BindingDB:
Activity Spreadsheet -- Enzyme Inhibition Constant Data from BindingDB
Found 1 hit for monomerid = 338383
TargetNuclear receptor ROR-gamma(Homo sapiens (Human))
Genentech
US Patent
LigandPNGBDBM338383((3R,6S)-2-(4-(4-(4H-1,2,4-triazol-4- yl)piperidin-...)
Affinity DataIC50:  148nM. Assay description: Assays were carried out in 16-microL reaction volumes in black 384 Plus F Proxiplates (Perkin-Elmer 6008269). All assay components except test ligand...
Ligand InfoPC cidPC sid
In DepthDetails US Patent