BDBM338445 2-[2,5-difluoro-4-[[(3S,6R)-3- methyl-1,1-dioxo-6-phenyl- thiazinan-2-yl]methyl]phenyl]-2- (oxetan-3-yl)ethanol::US9751873, Example 132::US9751873, Example 133
SMILES C[C@H]1CC[C@H](c2ccccc2)S(=O)(=O)N1Cc1cc(F)c(cc1F)C(CO)C1COC1
InChI Key InChIKey=INXAONFPYSTUEC-FZVNPLTNSA-N
Data  2 IC50
  Tab Delimited (TSV)   2D SDfile   Computed 3D by Vconf -m prep SDfile
Find this compound or compounds like it in BindingDB:
Activity Spreadsheet -- Enzyme Inhibition Constant Data from BindingDB
Found 2 hits for monomerid = 338445
TargetNuclear receptor ROR-gamma(Homo sapiens (Human))
Genentech
US Patent
LigandPNGBDBM338445(2-[2,5-difluoro-4-[[(3S,6R)-3- methyl-1,1-dioxo-6-...)
Affinity DataIC50:  25nM. Assay description: Assays were carried out in 16-microL reaction volumes in black 384 Plus F Proxiplates (Perkin-Elmer 6008269). All assay components except test ligand...
Ligand InfoPC cidPC sid
In DepthDetails US Patent
TargetNuclear receptor ROR-gamma(Homo sapiens (Human))
Genentech
US Patent
LigandPNGBDBM338445(2-[2,5-difluoro-4-[[(3S,6R)-3- methyl-1,1-dioxo-6-...)
Affinity DataIC50:  51nM. Assay description: Assays were carried out in 16-microL reaction volumes in black 384 Plus F Proxiplates (Perkin-Elmer 6008269). All assay components except test ligand...
Ligand InfoPC cidPC sid
In DepthDetails US Patent