BDBM338456 4-[2,5-difluoro-4-[[(3S,6R)-3- methyl-1,1-dioxo-6-phenyl- thiazinan-2-yl]methyl]phenyl]- 5-hydroxy-pentanamide::US9751873, Example 143::US9751873, Example 144
SMILES C[C@H]1CC[C@H](c2ccccc2)S(=O)(=O)N1Cc1cc(F)c(cc1F)C(CO)CCC(N)=O
InChI Key InChIKey=YKVZSSIEFHOJON-SSMNUEENSA-N
Data  2 IC50
  Tab Delimited (TSV)   2D SDfile   Computed 3D by Vconf -m prep SDfile
Find this compound or compounds like it in BindingDB:
Activity Spreadsheet -- Enzyme Inhibition Constant Data from BindingDB
Found 2 hits for monomerid = 338456
TargetNuclear receptor ROR-gamma(Homo sapiens (Human))
Genentech
US Patent
LigandPNGBDBM338456(4-[2,5-difluoro-4-[[(3S,6R)-3- methyl-1,1-dioxo-6-...)
Affinity DataIC50:  29nM. Assay description: Assays were carried out in 16-microL reaction volumes in black 384 Plus F Proxiplates (Perkin-Elmer 6008269). All assay components except test ligand...
Ligand InfoPC cidPC sid
In DepthDetails US Patent
TargetNuclear receptor ROR-gamma(Homo sapiens (Human))
Genentech
US Patent
LigandPNGBDBM338456(4-[2,5-difluoro-4-[[(3S,6R)-3- methyl-1,1-dioxo-6-...)
Affinity DataIC50:  84nM. Assay description: Assays were carried out in 16-microL reaction volumes in black 384 Plus F Proxiplates (Perkin-Elmer 6008269). All assay components except test ligand...
Ligand InfoPC cidPC sid
In DepthDetails US Patent