BDBM338470 US9751881, Example 7::US9751881, Example 82
SMILES COc1cc(ncc1C#N)N1CCC2(C1)CCN(C[C@H](O)c1ccc3C(=O)OCc3c1C)CC2
InChI Key InChIKey=DOJLRYMITMQUDL-QFIPXVFZSA-N
Data  2 IC50
  Tab Delimited (TSV)   2D SDfile   Computed 3D by Vconf -m prep SDfile
Find this compound or compounds like it in BindingDB:
Activity Spreadsheet -- Enzyme Inhibition Constant Data from BindingDB
Found 2 hits for monomerid = 338470
TargetATP-sensitive inward rectifier potassium channel 1(Homo sapiens (Human))
Merck Sharp & Dohme
US Patent
LigandPNGBDBM338470(US9751881, Example 7 | US9751881, Example 82)
Affinity DataIC50:  32.8nM. Assay description: Assay Protocol: The ROMK channel functional thallium flux assay was performed in 384 wells, using the FLIPR-Tetra instrument. HEK-hKir1.1 cells were ...
Ligand InfoPC cidPC sid
In DepthDetails US Patent
TargetATP-sensitive inward rectifier potassium channel 1(Homo sapiens (Human))
Merck Sharp & Dohme
US Patent
LigandPNGBDBM338470(US9751881, Example 7 | US9751881, Example 82)
Affinity DataIC50:  21.5nM. Assay description: Assay Protocol: The ROMK channel functional thallium flux assay was performed in 384 wells, using the FLIPR-Tetra instrument. HEK-hKir1.1 cells were ...
Ligand InfoPC cidPC sid
In DepthDetails US Patent