BDBM338518 US9751881, Example 49
SMILES Cc1c2COC(=O)c2ccc1[C@@H](O)CN1CCC2(CN(C2)c2cnc(cn2)S(C)(=O)=O)CC1
InChI Key InChIKey=IJKJKGQPQXSDNZ-IBGZPJMESA-N
Data  1 IC50
  Tab Delimited (TSV)   2D SDfile   Computed 3D by Vconf -m prep SDfile
Find this compound or compounds like it in BindingDB:
Activity Spreadsheet -- Enzyme Inhibition Constant Data from BindingDB
Found 1 hit for monomerid = 338518
TargetATP-sensitive inward rectifier potassium channel 1(Homo sapiens (Human))
Merck Sharp & Dohme
US Patent
LigandPNGBDBM338518(US9751881, Example 49)
Affinity DataIC50:  118nM. Assay description: Assay Protocol: The ROMK channel functional thallium flux assay was performed in 384 wells, using the FLIPR-Tetra instrument. HEK-hKir1.1 cells were ...
Ligand InfoPC cidPC sid
In DepthDetails US Patent