BDBM338539 4-(trans-2- ((cyclopropylmethyl)- amino)cyclopropyl)-N- (pyridin-2- ylmethyl)benzamide bis(trifluoroacetate)::US9751885, 16
SMILES O=C(NCc1ccccn1)c1ccc(cc1)C1CC1NCC1CC1
InChI Key InChIKey=GNHVKPIUOJDHLB-UHFFFAOYSA-N
Data  3 IC50
  Tab Delimited (TSV)   2D SDfile   Computed 3D by Vconf -m prep SDfile
Find this compound or compounds like it in BindingDB:
Activity Spreadsheet -- Enzyme Inhibition Constant Data from BindingDB
Found 3 hits for monomerid = 338539
TargetLysine-specific histone demethylase 1A(Homo sapiens (Human))
Takeda Pharmaceutical
US Patent
LigandPNGBDBM338539(4-(trans-2- ((cyclopropylmethyl)- amino)cyclopropy...)
Affinity DataIC50: <100nM. Assay description: A test compound dissolved in 2.5% DMSO was added by 4 μL to 3 μL reaction solution (50 mM Tris-HCl (pH 8.0), 0.1% BSA, 1 mM DTT) containing...
Ligand InfoPC cidPC sid
In DepthDetails US Patent
TargetAmine oxidase [flavin-containing] B(Homo sapiens (Human))
Takeda Pharmaceutical
US Patent
LigandPNGBDBM338539(4-(trans-2- ((cyclopropylmethyl)- amino)cyclopropy...)
Affinity DataIC50: >1.00E+4nM. Assay description: The MAO-B inhibitory activity evaluation described below followed the protocol of MAO-Glo (registered trademark) Assay of Promega KK.A test compound ...
Ligand InfoPC cidPC sid
In DepthDetails US Patent
TargetAmine oxidase [flavin-containing] A(Homo sapiens (Human))
Takeda Pharmaceutical
US Patent
LigandPNGBDBM338539(4-(trans-2- ((cyclopropylmethyl)- amino)cyclopropy...)
Affinity DataIC50: >1.00E+4nM. Assay description: A test compound dissolved in 4% DMSO was added by 12.5 μL to 25 μL reaction solution (100 mM HEPES (pH 7.5), 5% glycerol) containing 400 ng...
Ligand InfoPC cidPC sid
In DepthDetails US Patent