BDBM338839 US9751886, Compound 4
SMILES C[C@]1(Cn2nncc2C(N)=N1)c1cc(NC(=O)c2ccc(Cl)cn2)ccc1F
InChI Key InChIKey=FIUOQWQRVSRKHL-SFHVURJKSA-N
Data  3 IC50
  Tab Delimited (TSV)   2D SDfile   Computed 3D by Vconf -m prep SDfile
Find this compound or compounds like it in BindingDB:
Activity Spreadsheet -- Enzyme Inhibition Constant Data from BindingDB
Found 3 hits for monomerid = 338839
TargetBeta-secretase 1(Homo sapiens (Human))
Janssen Pharmaceutica
US Patent
LigandPNGBDBM338839(US9751886, Compound 4)
Affinity DataIC50:  1.74nM. Assay description: This assay is a Fluorescence Resonance Energy Transfer Assay (FRET) based assay. The substrate for this assay is an APP derived 13 amino acids peptid...
Ligand InfoPC cidPC sid
In DepthDetails US Patent
TargetBeta-secretase 2(Homo sapiens (Human))
Janssen Pharmaceutica
US Patent
LigandPNGBDBM338839(US9751886, Compound 4)
Affinity DataIC50:  2.75nM. Assay description: This assay is a Fluorescence Resonance Energy Transfer Assay (FRET) based assay. The substrate for this assay contains the ¿Swedish¿ Lys-Met/Asn-Leu ...
Ligand InfoPC cidPC sid
In DepthDetails US Patent
TargetBeta-secretase 1(Homo sapiens (Human))
Janssen Pharmaceutica
US Patent
LigandPNGBDBM338839(US9751886, Compound 4)
Affinity DataIC50:  1.78nM. Assay description: This assay is a Fluorescence Resonance Energy Transfer Assay (FRET) based assay. The substrate for this assay is an APP derived 13 amino acids peptid...
Ligand InfoPC cidPC sid
In DepthDetails US Patent