BDBM338859 US9751888, Compound 46
SMILES C[C@H](NC(=O)c1nccnc1N)c1nc2cccc(Cl)c2c(=O)n1-c1ccc(F)cc1
InChI Key InChIKey=NVZWSTVVLCXWRJ-NSHDSACASA-N
Data  4 IC50
  Tab Delimited (TSV)   2D SDfile   Computed 3D by Vconf -m prep SDfile
Find this compound or compounds like it in BindingDB:
Activity Spreadsheet -- Enzyme Inhibition Constant Data from BindingDB
Found 4 hits for monomerid = 338859
TargetPhosphatidylinositol 3-kinase regulatory subunit alpha(Homo sapiens (Human))
Infinity Pharmaceuticals
US Patent
LigandPNGBDBM338859(US9751888, Compound 46)
Affinity DataIC50:  5.50E+3nM. Assay description: Class I PI3-Ks can be either purchased (p110α/p85α, p110β/p85α, p110δ/p85α from Upstate, and p110γ from Sigma) or ...
Ligand InfoPC cidPC sid
In DepthDetails US Patent
TargetPhosphatidylinositol 4,5-bisphosphate 3-kinase catalytic subunit gamma isoform(Homo sapiens (Human))
Infinity Pharmaceuticals
US Patent
LigandPNGBDBM338859(US9751888, Compound 46)
Affinity DataIC50:  300nM. Assay description: Class I PI3-Ks can be either purchased (p110α/p85α, p110β/p85α, p110δ/p85α from Upstate, and p110γ from Sigma) or ...
Ligand InfoPC cidPC sid
In DepthDetails US Patent
TargetPhosphatidylinositol 4,5-bisphosphate 3-kinase catalytic subunit delta isoform(Homo sapiens (Human))
Infinity Pharmaceuticals
US Patent
LigandPNGBDBM338859(US9751888, Compound 46)
Affinity DataIC50:  5.50E+3nM. Assay description: Class I PI3-Ks can be either purchased (p110α/p85α, p110β/p85α, p110δ/p85α from Upstate, and p110γ from Sigma) or ...
Ligand InfoPC cidPC sid
In DepthDetails US Patent
TargetPhosphatidylinositol 3-kinase regulatory subunit beta(Homo sapiens (Human))
Infinity Pharmaceuticals
US Patent
LigandPNGBDBM338859(US9751888, Compound 46)
Affinity DataIC50:  5.50E+3nM. Assay description: Class I PI3-Ks can be either purchased (p110α/p85α, p110β/p85α, p110δ/p85α from Upstate, and p110γ from Sigma) or ...
Ligand InfoPC cidPC sid
In DepthDetails US Patent