BDBM338928 (E)-3-amino-1-(3-(2,6-dichlorostyryl)phenyl)propan-1-::US10201545, Compound 50
SMILES NCCC(O)c1cccc(\C=C\c2c(Cl)cccc2Cl)c1
InChI Key InChIKey=JNCYMQSTWYVZCF-BQYQJAHWSA-N
Data  1 IC50
  Tab Delimited (TSV)   2D SDfile   Computed 3D by Vconf -m prep SDfile
Find this compound or compounds like it in BindingDB:
Activity Spreadsheet -- Enzyme Inhibition Constant Data from BindingDB
Found 1 hit for monomerid = 338928
TargetRetinaldehyde-binding protein 1(Homo sapiens (Human))
Acucela
US Patent
LigandPNGBDBM338928((E)-3-amino-1-(3-(2,6-dichlorostyryl)phenyl)propan...)
Affinity DataIC50: <1.00E+3nM. Assay description: The isomerase assay was performed in 10 mM bis-tris-propane (BTP) buffer, pH 7.5, 0.5% BSA (diluted in BTP buffer), 1 mM sodium pyrophosphate, 20 ...
Ligand InfoPC cidPC sid
In DepthDetails US Patent