BDBM338954 (E)-2-(3-(2,6-dimethylstyryl)phenylthio)ethanamine::US10201545, Compound 18
SMILES Cc1cccc(C)c1\C=C\c1cccc(SCCN)c1
InChI Key InChIKey=JXMWFGDSUMHILQ-MDZDMXLPSA-N
Data  1 IC50
  Tab Delimited (TSV)   2D SDfile   Computed 3D by Vconf -m prep SDfile
Find this compound or compounds like it in BindingDB:
Activity Spreadsheet -- Enzyme Inhibition Constant Data from BindingDB
Found 1 hit for monomerid = 338954
TargetRetinaldehyde-binding protein 1(Homo sapiens (Human))
Acucela
US Patent
LigandPNGBDBM338954((E)-2-(3-(2,6-dimethylstyryl)phenylthio)ethanamine...)
Affinity DataIC50: <1.00E+4nM. Assay description: The isomerase assay was performed in 10 mM bis-tris-propane (BTP) buffer, pH 7.5, 0.5% BSA (diluted in BTP buffer), 1 mM sodium pyrophosphate, 20 ...
Ligand InfoPC cidPC sid
In DepthDetails US Patent