BDBM338967 (E/Z)-3-(3-(2,4-dimethylstyryl)phenyl)propan-1-amine::US10201545, Compound 34
SMILES Cc1ccc(\C=C/c2cccc(CCCN)c2)c(C)c1
InChI Key InChIKey=HAZWTJPUNVFXKC-LUAWRHEFSA-N
Data  1 IC50
  Tab Delimited (TSV)   2D SDfile   Computed 3D by Vconf -m prep SDfile
Find this compound or compounds like it in BindingDB:
Activity Spreadsheet -- Enzyme Inhibition Constant Data from BindingDB
Found 1 hit for monomerid = 338967
TargetRetinaldehyde-binding protein 1(Homo sapiens (Human))
Acucela
US Patent
LigandPNGBDBM338967((E/Z)-3-(3-(2,4-dimethylstyryl)phenyl)propan-1-ami...)
Affinity DataIC50: <1.00E+4nM. Assay description: The isomerase assay was performed in 10 mM bis-tris-propane (BTP) buffer, pH 7.5, 0.5% BSA (diluted in BTP buffer), 1 mM sodium pyrophosphate, 20 ...
Ligand InfoPC cidPC sid
In DepthDetails US Patent