BDBM339043 US10201546, Example 9
SMILES CC(=O)N1CCC(CC1)C(O)(c1cncn1C)c1ccc2nc(c(C(=O)N3CCCCC3)c(c2c1)C(F)(F)F)C(F)(F)F
InChI Key InChIKey=HYTKSRCHBQJPLO-UHFFFAOYSA-N
Data  1 IC50  1 Kd
  Tab Delimited (TSV)   2D SDfile   Computed 3D by Vconf -m prep SDfile
Find this compound or compounds like it in BindingDB:
Activity Spreadsheet -- Enzyme Inhibition Constant Data from BindingDB
Found 2 hits for monomerid = 339043
TargetNuclear receptor ROR-gamma(Homo sapiens (Human))
Janssen Pharmaceutica
US Patent
LigandPNGBDBM339043(US10201546, Example 9)
Affinity DataIC50: >6.00E+3nM. Assay description: For the RORγt construct used in the ThermoFluorŪ assay, numbering for the nucleotide sequences was based on the reference sequence for human ROR...
Ligand InfoPC cidPC sid
In DepthDetails US Patent
TargetNuclear receptor ROR-gamma(Homo sapiens (Human))
Janssen Pharmaceutica
US Patent
LigandPNGBDBM339043(US10201546, Example 9)
Affinity DataKd:  8.20E+3nM. Assay description: ThermoFluor is a fluorescence based assay that estimates ligand binding affinities by measuring the effect of a ligand on protein thermal stability (...
Ligand InfoPC cidPC sid
In DepthDetails US Patent