BDBM339073 US10201546, Example 28
SMILES CC(C)(C)c1c(nc2ccc(cc2c1-c1ccco1)C(O)(c1cccnc1)c1cccc(Cl)c1)-c1ccco1
InChI Key InChIKey=QHGBAHASEBRZFX-UHFFFAOYSA-N
Data  1 IC50  1 Kd
  Tab Delimited (TSV)   2D SDfile   Computed 3D by Vconf -m prep SDfile
Find this compound or compounds like it in BindingDB:
Activity Spreadsheet -- Enzyme Inhibition Constant Data from BindingDB
Found 2 hits for monomerid = 339073
TargetNuclear receptor ROR-gamma(Homo sapiens (Human))
Janssen Pharmaceutica
US Patent
LigandPNGBDBM339073(US10201546, Example 28)
Affinity DataIC50:  6.00E+3nM. Assay description: For the RORγt construct used in the ThermoFluorŪ assay, numbering for the nucleotide sequences was based on the reference sequence for human ROR...
Ligand InfoPC cidPC sid
In DepthDetails US Patent
TargetNuclear receptor ROR-gamma(Homo sapiens (Human))
Janssen Pharmaceutica
US Patent
LigandPNGBDBM339073(US10201546, Example 28)
Affinity DataKd:  4.80E+3nM. Assay description: ThermoFluor is a fluorescence based assay that estimates ligand binding affinities by measuring the effect of a ligand on protein thermal stability (...
Ligand InfoPC cidPC sid
In DepthDetails US Patent