BDBM33943 5-nitro-2-thiophenecarboxylic acid [2-oxo-2-[3-(3,4,5,6-tetrahydro-2H-azepin-7-ylsulfamoyl)anilino]ethyl] ester::5-nitrothiophene-2-carboxylic acid [2-keto-2-[3-(3,4,5,6-tetrahydro-2H-azepin-7-ylsulfamoyl)anilino]ethyl] ester::MLS001003033::SMR000372681::[2-oxidanylidene-2-[[3-(3,4,5,6-tetrahydro-2H-azepin-7-ylsulfamoyl)phenyl]amino]ethyl] 5-nitrothiophene-2-carboxylate::[2-oxo-2-[3-(3,4,5,6-tetrahydro-2H-azepin-7-ylsulfamoyl)anilino]ethyl] 5-nitrothiophene-2-carboxylate::cid_4262418
SMILES [O-][N+](=O)c1ccc(s1)C(=O)OCC(=O)Nc1cccc(c1)S(=O)(=O)\[NH+]=C1\CCCCC[N-]1
InChI Key InChIKey=NMXOMIRISIDRBZ-UHFFFAOYSA-N
Data  4 IC50  2 EC50
  Tab Delimited (TSV)   2D SDfile   Computed 3D by Vconf -m prep SDfile
Find this compound or compounds like it in BindingDB:
Activity Spreadsheet -- Enzyme Inhibition Constant Data from BindingDB
Found 6 hits for monomerid = 33943
TargetProthrombin(Homo sapiens (Human))
Pcmd
Curated by PubChem BioAssay
LigandPNGBDBM33943(5-nitro-2-thiophenecarboxylic acid [2-oxo-2-[3-(3,...)
Affinity DataIC50: >5.00E+4nMpH: 7.5 T: 2°C. Assay description: HTS was performed using 217,350 compounds of the MLSCN library individually plated into 10ul 1536 compound plates at a concentration of 2.5 mM each, ...
In DepthDetails PCBioAssay
TargetCaspase-3(Homo sapiens (Human))
Burnham Center For Chemical Genomics
Curated by PubChem BioAssay
LigandPNGBDBM33943(5-nitro-2-thiophenecarboxylic acid [2-oxo-2-[3-(3,...)
Affinity DataIC50:  1.00E+4nM. Assay description: Data Source: Sanford-Burnham Center for Chemical Genomics (SBCCG) Source Affiliation: Sanford-Burnham Medical Research Institute (SBMRI, San Diego, C...
In DepthDetails PCBioAssay
TargetMitochondrial peptide methionine sulfoxide reductase(Bos taurus)
The Scripps Research Institute Molecular Screening Center
Curated by PubChem BioAssay
LigandPNGBDBM33943(5-nitro-2-thiophenecarboxylic acid [2-oxo-2-[3-(3,...)
Affinity DataEC50:  7.04E+4nM. Assay description: Source (MLPCN Center Name): The Scripps Research Institute Molecular Screening Center (SRIMSC) Affiliation: The Scripps Research Institute, TSRI Assa...
In DepthDetails PCBioAssay
TargetSentrin-specific protease 6(Homo sapiens (Human))
Burnham Center For Chemical Genomics
Curated by PubChem BioAssay
LigandPNGBDBM33943(5-nitro-2-thiophenecarboxylic acid [2-oxo-2-[3-(3,...)
Affinity DataIC50:  4.62E+3nM. Assay description: Data Source: Sanford-Burnham Center for Chemical Genomics (SBCCG) Source Affiliation: Sanford-Burnham Medical Research Institute (SBMRI, San Diego, C...
In DepthDetails PCBioAssay
TargetCorticotropin-releasing factor-binding protein(Homo sapiens (Human))
Burnham Center For Chemical Genomics
Curated by PubChem BioAssay
LigandPNGBDBM33943(5-nitro-2-thiophenecarboxylic acid [2-oxo-2-[3-(3,...)
Affinity DataEC50: >5.30E+4nM. Assay description: Data Source: Sanford-Burnham Center for Chemical Genomics (SBCCG) Source Affiliation: Sanford-Burnham Medical Research Institute (SBMRI, San Diego, C...
In DepthDetails PCBioAssay
TargetSentrin-specific protease 8(Homo sapiens (Human))
Burnham Center For Chemical Genomics
Curated by PubChem BioAssay
LigandPNGBDBM33943(5-nitro-2-thiophenecarboxylic acid [2-oxo-2-[3-(3,...)
Affinity DataIC50:  4.92E+3nM. Assay description: Data Source: Sanford-Burnham Center for Chemical Genomics (SBCCG) Source Affiliation: Sanford-Burnham Medical Research Institute (SBMRI, San Diego, C...
In DepthDetails PCBioAssay