BDBM339431 US10202339, Compound 208
SMILES Cc1ccc(NC(=O)Nc2ccc(OC(F)(F)F)cc2)cc1S(=O)(=O)Nc1ccccc1
InChI Key InChIKey=FXWGNUUDISXXRI-UHFFFAOYSA-N
Data  1 IC50
  Tab Delimited (TSV)   2D SDfile   Computed 3D by Vconf -m prep SDfile
Find this compound or compounds like it in BindingDB:
Activity Spreadsheet -- Enzyme Inhibition Constant Data from BindingDB
Found 1 hit for monomerid = 339431
TargetIsocitrate dehydrogenase [NADP] cytoplasmic [R132H](Homo sapiens (Human))
Agios Pharmaceuticals
US Patent
LigandPNGBDBM339431(US10202339, Compound 208)
Affinity DataIC50:  5.50E+3nM. Assay description: Assays were conducted in a volume of 76 μl assay buffer (150 mM NaCl, 10 mM MgCl2, 20 mM Tris pH 7.5, 0.03% bovine serum albumin) as follows in ...
Ligand InfoPC cidPC sid
In DepthDetails US Patent