BDBM339771 US10202339, Compound 341
SMILES CN(c1ccccc1)c1ccc(cc1NC(=O)Nc1cccc(c1)C(F)(F)F)S(=O)(=O)Nc1ccccc1
InChI Key InChIKey=MXYCVMRXMNJHMQ-UHFFFAOYSA-N
Data  1 IC50
  Tab Delimited (TSV)   2D SDfile   Computed 3D by Vconf -m prep SDfile
Find this compound or compounds like it in BindingDB:
Activity Spreadsheet -- Enzyme Inhibition Constant Data from BindingDB
Found 1 hit for monomerid = 339771
TargetIsocitrate dehydrogenase [NADP], mitochondrial [R140Q](Homo sapiens (Human))
Agios Pharmaceuticals
US Patent
LigandPNGBDBM339771(US10202339, Compound 341)
Affinity DataIC50:  5.50E+3nM. Assay description: Compounds were assayed for IDH2 R140Q inhibitory activity through a cofactor depletion assay. Compounds were preincubated with enzyme, then the react...
Ligand InfoPC cidPC sid
In DepthDetails US Patent