BDBM339786 US10202340, Example 5
SMILES COc1cc(ccc1F)[C@@H](O)[C@@H](CN1CCCC1)NC(=O)CC1Cc2ccccc2C1
InChI Key InChIKey=NANWPOJHGMQXNP-RCZVLFRGSA-N
Data  3 IC50
  Tab Delimited (TSV)   2D SDfile   Computed 3D by Vconf -m prep SDfile
Find this compound or compounds like it in BindingDB:
Activity Spreadsheet -- Enzyme Inhibition Constant Data from BindingDB
Found 3 hits for monomerid = 339786
TargetCeramide glucosyltransferase(Homo sapiens (Human))
The Regents Of The University Of Michigan
US Patent
LigandPNGBDBM339786(US10202340, Example 5)
Affinity DataIC50: >300nM. Assay description: Inhibition of GlcCer synthesis in broken wild-type MDCK cell preparations
Ligand InfoPC cidPC sid
In DepthDetails US Patent
TargetCeramide glucosyltransferase(Homo sapiens (Human))
The Regents Of The University Of Michigan
US Patent
LigandPNGBDBM339786(US10202340, Example 5)
Affinity DataIC50:  2.61E+3nM. Assay description: )Inhibition of GlcCer production in MDCKII cells stably expressing human MDR1 (obtained from The Netherlands Cancer Institute).
Ligand InfoPC cidPC sid
In DepthDetails US Patent
TargetCeramide glucosyltransferase(Homo sapiens (Human))
The Regents Of The University Of Michigan
US Patent
LigandPNGBDBM339786(US10202340, Example 5)
Affinity DataIC50:  73nM. Assay description: Inhibition of GlcCer production in whole wild-type MDCKII cells.
Ligand InfoPC cidPC sid
In DepthDetails US Patent