BDBM339808 US9757364, Compound 64
SMILES COc1cc(OC)c(F)c(N(Cc2nccn2S(=O)(=O)N(C)C)c2ccc3ncc(cc3n2)-c2cnn(C)c2)c1F
InChI Key InChIKey=CUMCBEDCPQGOTJ-UHFFFAOYSA-N
Data  5 IC50
  Tab Delimited (TSV)   2D SDfile   Computed 3D by Vconf -m prep SDfile
Find this compound or compounds like it in BindingDB:
Activity Spreadsheet -- Enzyme Inhibition Constant Data from BindingDB
Found 5 hits for monomerid = 339808
TargetFibroblast growth factor receptor 1(Homo sapiens (Human))
Astex Therapeutics
US Patent
LigandPNGBDBM339808(US9757364, Compound 64)
Affinity DataIC50:  2.95nM. Assay description: In a final reaction volume of 30 μL, FGFR1 (h) (25 ng/ml) was incubated with 50 mM HEPES pH 7.5, 6 mM MnCl2, 1 mM DTT, 0.1 mM Na3VO4, 0.01% Trit...
Ligand InfoPC cidPC sid
In DepthDetails US Patent
TargetFibroblast growth factor receptor 2(Homo sapiens (Human))
Astex Therapeutics
US Patent
LigandPNGBDBM339808(US9757364, Compound 64)
Affinity DataIC50:  7.76nM. Assay description: In a final reaction volume of 30 μL, FGFR2 (h) (150 ng/ml) was incubated with 50 mM HEPES pH 7.5, 6 mM MnCl2, 1 mM DTT, 0.1 mM Na3VO4, 0.01% Tri...
Ligand InfoPC cidPC sid
In DepthDetails US Patent
TargetVascular endothelial growth factor receptor 2(Homo sapiens (Human))
Astex Therapeutics
US Patent
LigandPNGBDBM339808(US9757364, Compound 64)
Affinity DataIC50:  34.7nM. Assay description: In a final reaction volume of 30 μL, KDR (h) (150 ng/ml) was incubated with 50 mM HEPES pH 7.5, 6 mM MnCl2, 1 mM DTT, 0.1 mM Na3VO4, 0.01% Trito...
Ligand InfoPC cidPC sid
In DepthDetails US Patent
TargetFibroblast growth factor receptor 4(Homo sapiens (Human))
Astex Therapeutics
US Patent
LigandPNGBDBM339808(US9757364, Compound 64)
Affinity DataIC50:  2.88nM. Assay description: In a final reaction volume of 30 μL, FGFR4 (h) (60 ng/ml) was incubated with 50 mM HEPES pH 7.5, 6 mM MnCl2, 1 mM DTT, 0.1 mM Na3VO4, 0.01% Trit...
Ligand InfoPC cidPC sid
In DepthDetails US Patent
TargetFibroblast growth factor receptor 3(Homo sapiens (Human))
Astex Therapeutics
US Patent
LigandPNGBDBM339808(US9757364, Compound 64)
Affinity DataIC50:  3.55nM. Assay description: In a final reaction volume of 30 μL, FGFR3 (h) (40 ng/ml) was incubated with 50 mM HEPES pH 7.5, 6 mM MnCl2, 1 mM DTT, 0.1 mM Na3VO4, 0.01% Trit...
Ligand InfoPC cidPC sid
In DepthDetails US Patent