BDBM339865 US9757364, Compound 56
SMILES COc1cc(OC)c(F)c(c1)N(Cc1ccn(n1)S(=O)(=O)N(C)C)c1ccc2ncc(cc2n1)-c1cnn(C)c1
InChI Key InChIKey=JXPPMHWXIOAVMA-UHFFFAOYSA-N
Data  5 IC50
  Tab Delimited (TSV)   2D SDfile   Computed 3D by Vconf -m prep SDfile
Find this compound or compounds like it in BindingDB:
Activity Spreadsheet -- Enzyme Inhibition Constant Data from BindingDB
Found 5 hits for monomerid = 339865
TargetFibroblast growth factor receptor 1(Homo sapiens (Human))
Astex Therapeutics
US Patent
LigandPNGBDBM339865(US9757364, Compound 56)
Affinity DataIC50:  2.14nM. Assay description: In a final reaction volume of 30 μL, FGFR1 (h) (25 ng/ml) was incubated with 50 mM HEPES pH 7.5, 6 mM MnCl2, 1 mM DTT, 0.1 mM Na3VO4, 0.01% Trit...
Ligand InfoPC cidPC sid
In DepthDetails US Patent
TargetFibroblast growth factor receptor 2(Homo sapiens (Human))
Astex Therapeutics
US Patent
LigandPNGBDBM339865(US9757364, Compound 56)
Affinity DataIC50:  5.62nM. Assay description: In a final reaction volume of 30 μL, FGFR2 (h) (150 ng/ml) was incubated with 50 mM HEPES pH 7.5, 6 mM MnCl2, 1 mM DTT, 0.1 mM Na3VO4, 0.01% Tri...
Ligand InfoPC cidPC sid
In DepthDetails US Patent
TargetVascular endothelial growth factor receptor 2(Homo sapiens (Human))
Astex Therapeutics
US Patent
LigandPNGBDBM339865(US9757364, Compound 56)
Affinity DataIC50:  49nM. Assay description: In a final reaction volume of 30 μL, KDR (h) (150 ng/ml) was incubated with 50 mM HEPES pH 7.5, 6 mM MnCl2, 1 mM DTT, 0.1 mM Na3VO4, 0.01% Trito...
Ligand InfoPC cidPC sid
In DepthDetails US Patent
TargetFibroblast growth factor receptor 4(Homo sapiens (Human))
Astex Therapeutics
US Patent
LigandPNGBDBM339865(US9757364, Compound 56)
Affinity DataIC50:  6.17nM. Assay description: In a final reaction volume of 30 μL, FGFR4 (h) (60 ng/ml) was incubated with 50 mM HEPES pH 7.5, 6 mM MnCl2, 1 mM DTT, 0.1 mM Na3VO4, 0.01% Trit...
Ligand InfoPC cidPC sid
In DepthDetails US Patent
TargetFibroblast growth factor receptor 3(Homo sapiens (Human))
Astex Therapeutics
US Patent
LigandPNGBDBM339865(US9757364, Compound 56)
Affinity DataIC50:  7.08nM. Assay description: In a final reaction volume of 30 μL, FGFR3 (h) (40 ng/ml) was incubated with 50 mM HEPES pH 7.5, 6 mM MnCl2, 1 mM DTT, 0.1 mM Na3VO4, 0.01% Trit...
Ligand InfoPC cidPC sid
In DepthDetails US Patent