BDBM339884 5-{(2S,3S)-1-[trans-4-(tert-Butoxycarbonylaminomethyl)cyclohexanecarbonyl]-3-phenylpyrrolidine-2-carboxamide}-1H-indole-2-carboxamide::US9758480, 24
SMILES NC[C@H]1CC[C@@H](CC1)C(=O)N1CCC([C@H]1C(=O)Nc1ccc2[nH]c(cc2c1)C(N)=O)c1ccccc1
InChI Key
Data  1 IC50
  Tab Delimited (TSV)   2D SDfile   Computed 3D by Vconf -m prep SDfile
Find this compound or compounds like it in BindingDB:
Activity Spreadsheet -- Enzyme Inhibition Constant Data from BindingDB
Found 1 hit for monomerid = 339884
TargetCoagulation factor XI(Homo sapiens (Human))
Sumitomo Dainippon Pharma
US Patent
LigandPNGBDBM339884(5-{(2S,3S)-1-[trans-4-(tert-Butoxycarbonylaminomet...)
Affinity DataIC50:  34nM. Assay description: 0.35 μg/mL human FXIa was allowed to react with a substrate and a test compound in a 30 mmol/L HEPES buffer solution (pH 7.4) that contained 145...
Ligand InfoPC cidPC sid
In DepthDetails US Patent