BDBM339886 6-Chloro-N′-dodecanoyl-4-hydroxy-2-oxo-2-hydroquinoline-3-carbohydrazide::US9757369, 48
SMILES CCCCCCCCCCCC(=O)NNC(=O)c1c(O)c2cc(Cl)ccc2[nH]c1=O
InChI Key InChIKey=GIOINUSHTJQBSN-UHFFFAOYSA-N
Data  2 IC50
  Tab Delimited (TSV)   2D SDfile   Computed 3D by Vconf -m prep SDfile
Find this compound or compounds like it in BindingDB:
Activity Spreadsheet -- Enzyme Inhibition Constant Data from BindingDB
Found 2 hits for monomerid = 339886
TargetGlycogen synthase kinase-3 beta(Homo sapiens (Human))
Centro De Investigaciones Biol�Gicas-Csic
Curated by ChEMBL
LigandPNGBDBM339886(6-Chloro-N′-dodecanoyl-4-hydroxy-2-oxo-2-hyd...)
Affinity DataIC50:  3.81E+3nM. Assay description: Allosteric inhibition of human recombinant full length N-terminal GST-tagged GSK3beta expressed in fall armyworm Sf9 cells after 30 min in presence o...
Ligand InfoPC cidPC sid
In DepthDetails ArticlePubMed
TargetGlycogen synthase kinase-3 beta(Homo sapiens (Human))
Centro De Investigaciones Biol�Gicas-Csic
Curated by ChEMBL
LigandPNGBDBM339886(6-Chloro-N′-dodecanoyl-4-hydroxy-2-oxo-2-hyd...)
Affinity DataIC50:  3.81E+3nM. Assay description: The enzyme inhibition assays were performed using the luminometric methodology of Kinase-GloŽ. The recombinant human GSK3 enzyme (catalogue no. 14-30...
Ligand InfoPC cidPC sid
In DepthDetails US Patent