BDBM339887 5-[(2S,3S)-1-{trans-4-[1-(tert-Butoxycarbonyl)amino-2-fluoroethyl]cyclohexanecarbonyl}-3-cyclohexylpyrrolidine-2-carboxamide]-1-methyl-1H-indole-2-carboxylic acid::US9758480, 29
SMILES Cn1c(cc2cc(NC(=O)[C@@H]3[C@@H](CCN3C(=O)[C@H]3CC[C@@H](CC3)C(N)CF)C3CCCCC3)ccc12)C(O)=O
InChI Key InChIKey=PGLTWWGBQVFETI-JOAKWLJISA-N
Data  1 IC50
  Tab Delimited (TSV)   2D SDfile   Computed 3D by Vconf -m prep SDfile
Find this compound or compounds like it in BindingDB:
Activity Spreadsheet -- Enzyme Inhibition Constant Data from BindingDB
Found 1 hit for monomerid = 339887
TargetCoagulation factor XI(Homo sapiens (Human))
Sumitomo Dainippon Pharma
US Patent
LigandPNGBDBM339887(5-[(2S,3S)-1-{trans-4-[1-(tert-Butoxycarbonyl)amin...)
Affinity DataIC50:  82nM. Assay description: 0.35 μg/mL human FXIa was allowed to react with a substrate and a test compound in a 30 mmol/L HEPES buffer solution (pH 7.4) that contained 145...
Ligand InfoPC cidPC sid
In DepthDetails US Patent