BDBM339894 5-[(2S,3R)-1-{trans-4-[1-(tert-Butoxycarbonylamino)ethyl]cyclohexanecarbonyl}-3-phenylpyrrolidine-2-carboxamide]-1-benzofuran-2-carboxylic acid::US9758480, 46
SMILES CC(N)[C@H]1CC[C@@H](CC1)C(=O)N1CC[C@@H]([C@H]1C(=O)Nc1ccc2oc(cc2c1)C(O)=O)c1ccccc1
InChI Key InChIKey=UDCNLRXAJYRYBT-NPGVDRKYSA-N
Data  1 IC50
  Tab Delimited (TSV)   2D SDfile   Computed 3D by Vconf -m prep SDfile
Find this compound or compounds like it in BindingDB:
Activity Spreadsheet -- Enzyme Inhibition Constant Data from BindingDB
Found 1 hit for monomerid = 339894
TargetCoagulation factor XI(Homo sapiens (Human))
Sumitomo Dainippon Pharma
US Patent
LigandPNGBDBM339894(5-[(2S,3R)-1-{trans-4-[1-(tert-Butoxycarbonylamino...)
Affinity DataIC50:  90nM. Assay description: 0.35 μg/mL human FXIa was allowed to react with a substrate and a test compound in a 30 mmol/L HEPES buffer solution (pH 7.4) that contained 145...
Ligand InfoPC cidPC sid
In DepthDetails US Patent